Target
N-acylethanolamine-hydrolyzing acid amidase
Ligand
BDBM393410
Substrate
Meas. Tech.
Inhibition Assay
IC50
>1000±n/a nM
Citation
 Malamas, MMakriyannis, ASubramanian, KVWhitten, KMZvonok, NMWest, JMMccormack, MPavlopoulos, S N-acylethanolamine hydrolyzing acid amidase (NAAA) inhibitors and their use thereof US Patent  US9963444 Publication Date 5/8/2018 
Target
Name:
N-acylethanolamine-hydrolyzing acid amidase
Synonyms:
ASAH-like protein Acid ceramidase-like protein N-acylsphingosine amidohydrolase-like NAAA PLT
Type:
Enzyme
Mol. Mass.:
40073.12
Organism:
Homo sapiens (Human)
Description:
Q02083
Residue:
359
  
Inhibitor
Name:
BDBM393410
Synonyms:
5-([1,1'-Biphenyl]-4-ylmethoxy)picolinonitrile | US9963444, Example 111
Type:
Small organic molecule
Emp. Form.:
C19H14N2O
Mol. Mass.:
286.3273
SMILES:
N#Cc1ccc(OCc2ccc(cc2)-c2ccccc2)cn1
: