Target
N-acylethanolamine-hydrolyzing acid amidase
Ligand
BDBM393416
Substrate
Meas. Tech.
Inhibition Assay
IC50
>1000±n/a nM
Citation
 Malamas, MMakriyannis, ASubramanian, KVWhitten, KMZvonok, NMWest, JMMccormack, MPavlopoulos, S N-acylethanolamine hydrolyzing acid amidase (NAAA) inhibitors and their use thereof US Patent  US9963444 Publication Date 5/8/2018 
Target
Name:
N-acylethanolamine-hydrolyzing acid amidase
Synonyms:
ASAH-like protein Acid ceramidase-like protein N-acylsphingosine amidohydrolase-like NAAA PLT
Type:
Enzyme
Mol. Mass.:
40073.12
Organism:
Homo sapiens (Human)
Description:
Q02083
Residue:
359
  
Inhibitor
Name:
BDBM393416
Synonyms:
5-(2-(2-(benzyloxy)ethoxy)ethoxy)pyrimidine-2-carbonitrile | US9963444, Example 117
Type:
Small organic molecule
Emp. Form.:
C16H17N3O3
Mol. Mass.:
299.3245
SMILES:
N#Cc1ncc(OCCOCCOCc2ccccc2)cn1
: