Target
Serine/threonine-protein kinase pim-1
Ligand
BDBM393432
Substrate
Meas. Tech.
Biological Assay
Ki
0.043±n/a nM
Citation
 Burch, JChen, HWang, X Oxepan-2-yl-pyrazol-4-yl-heterocyclyl-carboxamide compounds and methods of use US Patent  US9963446 Publication Date 5/8/2018 
Target
Name:
Serine/threonine-protein kinase pim-1
Synonyms:
PIM-1 Kinase PIM1_HUMAN Serine/threonine-protein kinase (PIM1) Serine/threonine-protein kinase PIM1 | Serine/threonine-protein kinase pim-1 (PIM1)
Type:
Protein
Mol. Mass.:
35681.82
Organism:
Homo sapiens (Human)
Description:
P11309
Residue:
313
  
Inhibitor
Name:
BDBM393432
Synonyms:
N-[5-[(2S,5R,6S)-5-amino-6- fluoro-oxepan-2-yl]-1-methyl- pyrazol-4-yl]-2-(5-methoxy-3- methyl-2-pyridyl)thiazole-4- carboxamide | US9963446, Example 119
Type:
Small organic molecule
Emp. Form.:
C21H25FN6O3S
Mol. Mass.:
460.525
SMILES:
COc1cnc(-c2nc(cs2)C(=O)Nc2cnn(C)c2[C@@H]2CC[C@@H](N)[C@H](F)CO2)c(C)c1
: