Target
Dipeptidyl peptidase 1
Ligand
BDBM150555
Substrate
Meas. Tech.
Inhibition Assay of Human DPPI (Cathepsin C)
pH
6±n/a
Temperature
298.15±n/a K
IC50
1.70±n/a nM
Comments
extracted
Citation
 Anderskewitz, RBinder, FGrauert, MGrundl, MHaebel, PWOost, TPautsch, APeters, SVintonyak, V Methods for treating pulmonary emphysema using substituted 2-Aza-bicyclo[2.2.1]heptane-3-carboxylic acid (benzyl-cyano-methyl)-amides inhibitors of cathepsin C US Patent  US9713606 Publication Date 7/25/2017 
Target
Name:
Dipeptidyl peptidase 1
Synonyms:
CATC_HUMAN CTSC Cathepsin J Dipeptidyl peptidase 1 (DPPI) Dipeptidyl peptidase I (DPPI)
Type:
Enzyme
Mol. Mass.:
51857.28
Organism:
Homo sapiens (Human)
Description:
P53634
Residue:
463
  
Inhibitor
Name:
BDBM150555
Synonyms:
US10238633, Example 229 US9713606, 229
Type:
Small organic molecule
Emp. Form.:
C28H32FN5O2S
Mol. Mass.:
521.649
SMILES:
Fc1cc(ccc1C[C@H](NC(=O)[C@H]1N[C@@H]2CC[C@H]1C2)C#N)-c1csc(c1)C(=O)N1CCN(CC1)C1CC1
: