Target
Cathepsin K
Ligand
BDBM150336
Substrate
Meas. Tech.
Inhibition Assay of Human Cathepsin K
pH
3.5±n/a
Temperature
298.15±n/a K
IC50
2700±n/a nM
Comments
extracted
Citation
 Anderskewitz, RBinder, FGrauert, MGrundl, MHaebel, PWOost, TPautsch, APeters, SVintonyak, V Methods for treating pulmonary emphysema using substituted 2-Aza-bicyclo[2.2.1]heptane-3-carboxylic acid (benzyl-cyano-methyl)-amides inhibitors of cathepsin C US Patent  US9713606 Publication Date 7/25/2017 
Target
Name:
Cathepsin K
Synonyms:
CATK_HUMAN CTSO Cathepsin O Cathepsin X
Type:
Enzyme
Mol. Mass.:
36975.68
Organism:
Homo sapiens (Human)
Description:
P43235
Residue:
329
  
Inhibitor
Name:
BDBM150336
Synonyms:
US10238633, Example 10 US9713606, 10
Type:
Small organic molecule
Emp. Form.:
C25H23FN4O3
Mol. Mass.:
446.4735
SMILES:
CN1C(=O)C(=O)c2ccc(cc12)-c1ccc(C[C@H](NC(=O)[C@H]2N[C@@H]3CC[C@H]2C3)C#N)c(F)c1
: