Target
Cathepsin K
Ligand
BDBM263602
Substrate
Meas. Tech.
Inhibition Assay of Human Cathepsin K
pH
3.5±n/a
Temperature
298.15±n/a K
IC50
7300±n/a nM
Comments
extracted
Citation
 Anderskewitz, RBinder, FGrauert, MGrundl, MHaebel, PWOost, TPautsch, APeters, SVintonyak, V Methods for treating pulmonary emphysema using substituted 2-Aza-bicyclo[2.2.1]heptane-3-carboxylic acid (benzyl-cyano-methyl)-amides inhibitors of cathepsin C US Patent  US9713606 Publication Date 7/25/2017 
Target
Name:
Cathepsin K
Synonyms:
CATK_HUMAN CTSO Cathepsin O Cathepsin X
Type:
Enzyme
Mol. Mass.:
36975.68
Organism:
Homo sapiens (Human)
Description:
P43235
Residue:
329
  
Inhibitor
Name:
BDBM263602
Synonyms:
US9713606, 31
Type:
Small organic molecule
Emp. Form.:
C25H24F2N4O2
Mol. Mass.:
450.4805
SMILES:
CN1C(=O)Cc2ccc(cc12)-c1cc(F)c(C[C@H](NC(=O)[C@H]2N[C@@H]3CC[C@H]2C3)C#N)cc1F
: