Target
Gamma-secretase subunit APH-1A/Gamma-secretase subunit PEN-2/Nicastrin [34-709]/Presenilin-1
Ligand
BDBM28990
Substrate
Beta amyloid A4 protein
Meas. Tech.
Cell-Based Assay for Amyloid-beta Accumulation
EC50
10.7±1.7 nM
Citation
 Churcher, IBeher, DBest, JDCastro, JLClarke, EEGentry, AHarrison, THitzel, LKay, EKerrad, SLewis, HDMorentin-Gutierrez, PMortishire-Smith, ROakley, PJReilly, MShaw, DEShearman, MSTeall, MRWilliams, SWrigley, JD 4-substituted cyclohexyl sulfones as potent, orally active gamma-secretase inhibitors. Bioorg Med Chem Lett 16:280-4 (2006)  
Target
Name:
Gamma-secretase subunit APH-1A/Gamma-secretase subunit PEN-2/Nicastrin [34-709]/Presenilin-1
Synonyms:
Gamma-Secretase
Type:
Multi-subunit protease complex
Mol. Mass.:
Description:
A complex composed of a presenilin homodimer, nicastrin, APH1 and PEN2. It is the minimal complex sufficient for secretase activity.
Components:
This complex has 4 components.
Component 1
Name:
Gamma-secretase subunit APH-1A
Synonyms:
APH-1a APH1A_HUMAN Gamma-Secretase Subunit APH-1A Presenilin-stabilization factor
Type:
Enzyme subunit; multi-pass membrane protein
Mol. Mass.:
28998.73
Organism:
Homo sapiens (Human)
Description:
Residue:
265
  
Component 2
Name:
Gamma-secretase subunit PEN-2
Synonyms:
Gamma-Secretase Subunit PEN-2 PEN2 PSENEN | Presenilin enhancer protein 2
Type:
Enzyme subunit; multi-pass membrane protein
Mol. Mass.:
12031.98
Organism:
Homo sapiens (Human)
Description:
Residue:
101
  
Component 3
Name:
Nicastrin [34-709]
Synonyms:
Gamma-Secretase Subunit Nicastrin NCSTN | NICA_HUMAN
Type:
Single-pass type I membrane protein
Mol. Mass.:
75243.23
Organism:
Homo sapiens (Human)
Description:
Q92542[34-709]
Residue:
676
  
Component 4
Name:
Presenilin-1
Synonyms:
3.4.23.- Gamma-Secretase Subunit Presenilin-1 PS1 PSEN1 PSNL1 Presenilin-1 CTF12 Protein S182
Type:
Mol. Mass.:
52657.13
Organism:
Homo sapiens (Human)
Description:
P49768
Residue:
467
  
Inhibitor
Name:
BDBM28990
Synonyms:
4-[(4-chlorobenzene)sulfonyl]-4-(2,5-difluorophenyl)cyclohexan-1-ol | cyclohexyl sulfone-based compound, 3
Type:
Small organic molecule
Emp. Form.:
C18H17ClF2O3S
Mol. Mass.:
386.841
SMILES:
O[C@H]1CC[C@@](CC1)(c1cc(F)ccc1F)S(=O)(=O)c1ccc(Cl)cc1
:
Substrate
Name:
Amyloid-beta precursor protein
Synonyms:
A4 ABPP AICD-50 AICD-59 AID(57) APP Alzheimer disease amyloid protein Amyloid beta Protein Amyloid beta protein Abeta(1-42) Amyloid intracellular domain 57 Amyloid protein (Abeta42b) Beta amyloid A4 protein Beta-APP42 Beta-amyloid protein 42 C83 CVAP Gamma Secretase Gamma-CTF(57) Gamma-secretase Gamma-secretase C-terminal fragment 57 P3(40) PN-II Protease nexin-II S-APP-beta Soluble APP-beta | beta-Amyloid Precursor Protein (APP)
Type:
Single-pass type I membrane protein
Mol. Mass.:
86890.41
Organism:
Homo sapiens (Human)
Description:
P05067
Residue:
770