Target
Dihydroorotate dehydrogenase (quinone), mitochondrial
Ligand
BDBM29030
Substrate
BDBM14700
Meas. Tech.
DHODH Inhibition Assay
pH
8±n/a
Temperature
298.15±n/a K
Ki
1200±n/a nM
IC50
9900±n/a nM
Km
13400±n/a nM
Citation
 Davies, MHeikkilä, TMcConkey, GAFishwick, CWParsons, MRJohnson, AP Structure-based design, synthesis, and characterization of inhibitors of human and Plasmodium falciparum dihydroorotate dehydrogenases. J Med Chem 52:2683-93 (2009)  
Target
Name:
Dihydroorotate dehydrogenase (quinone), mitochondrial
Synonyms:
DHOdehase Dihydroorotate dehydrogenase homolog PYRD_PLAF7
Type:
Enzyme
Mol. Mass.:
65581.88
Organism:
Plasmodium falciparum (isolate 3D7)
Description:
Q08210
Residue:
569
  
Inhibitor
Name:
BDBM29030
Synonyms:
cyanohydroxybutenamide, 20
Type:
Small organic molecule
Emp. Form.:
C17H11Cl3N2O2
Mol. Mass.:
381.64
SMILES:
CC(=O)C(C#N)C(=O)Nc1ccc(cc1Cl)-c1cccc(Cl)c1Cl
:
Substrate
Name:
BDBM14700
Synonyms:
2,3-dimethoxy-5-methyl-6-decyl-1,4-benzoquinone Decylubiquinone
Type:
Ubiquinone analog
Emp. Form.:
C19H30O4
Mol. Mass.:
322.4391
SMILES:
CCCCCCCCC=Cc1c(C)c(O)c(OC)c(OC)c1O
: