Target
Protein Wnt-3a
Ligand
BDBM263590
Substrate
Meas. Tech.
WNT Pathway Reporter Gene Assay
IC50
35.0±n/a nM
Citation
 An, S Compounds for treatment of cancer US Patent  US9713612 Publication Date 7/25/2017 
Target
Name:
Protein Wnt-3a
Synonyms:
WNT3A | WNT3A_HUMAN
Type:
PROTEIN
Mol. Mass.:
39379.02
Organism:
Homo sapiens (Human)
Description:
ChEMBL_1469237
Residue:
352
  
Inhibitor
Name:
BDBM263590
Synonyms:
US10087181, Compound 50 US9713612, 50
Type:
Small organic molecule
Emp. Form.:
C26H20FN5
Mol. Mass.:
421.4689
SMILES:
Cc1cc(ccn1)-c1ccc(CNc2nccc3nc(ccc23)-c2cccc(F)c2)cn1
: