Target
C-C chemokine receptor type 9
Ligand
BDBM393546
Substrate
Meas. Tech.
FLIPR Assay
Ki
53.0±n/a nM
Citation
 Bakthavatchalam, RBasu, MKBehera, AKVenkateshappa, CHewson, CAKadnur, SVKalindjian, SBKulkarni, BSaxena, RSuresh, JViswanathan, VZainuddin, MDharshinis, APKristam, R Compounds useful as CCR9 modulators US Patent  US9969687 Publication Date 5/15/2018 
Target
Name:
C-C chemokine receptor type 9
Synonyms:
CCR9 GPR28
Type:
PROTEIN
Mol. Mass.:
42023.90
Organism:
Homo sapiens (Human)
Description:
ChEMBL_1510356
Residue:
369
  
Inhibitor
Name:
BDBM393546
Synonyms:
US9969687, Compound 214
Type:
Small organic molecule
Emp. Form.:
C24H22ClN3O5S
Mol. Mass.:
499.967
SMILES:
Cc1cc(c[n+]([O-])c1)N1C(=O)c2c(C1=O)c(NS(=O)(=O)c1ccc(cc1)C(C)(C)C)ccc2Cl
: