Target
C-C chemokine receptor type 9
Ligand
BDBM393568
Substrate
Meas. Tech.
FLIPR Assay
Ki
23.0±n/a nM
Citation
 Bakthavatchalam, RBasu, MKBehera, AKVenkateshappa, CHewson, CAKadnur, SVKalindjian, SBKulkarni, BSaxena, RSuresh, JViswanathan, VZainuddin, MDharshinis, APKristam, R Compounds useful as CCR9 modulators US Patent  US9969687 Publication Date 5/15/2018 
Target
Name:
C-C chemokine receptor type 9
Synonyms:
CCR9 GPR28
Type:
PROTEIN
Mol. Mass.:
42023.90
Organism:
Homo sapiens (Human)
Description:
ChEMBL_1510356
Residue:
369
  
Inhibitor
Name:
BDBM393568
Synonyms:
US9969687, Compound 239
Type:
Small organic molecule
Emp. Form.:
C24H21ClFN3O4S
Mol. Mass.:
501.958
SMILES:
CC(C)(C)c1ccc(cc1)S(=O)(=O)Nc1ccc(Cl)c2C(=O)N(Cc3ncccc3F)C(=O)c12
: