Target
Free fatty acid receptor 1
Ligand
BDBM393624
Substrate
Meas. Tech.
Activity Assay
EC50
250±n/a nM
Citation
 Yang, JKim, JWLee, HKKim, JHSon, CMLee, nullChoi, HKim, nullHa, TRhee, J 3-(4-(benzyloxy)phenyl)hex-4-ynoic acid derivative, method of preparing same and pharmaceutical composition for preventing and treating metabolic disease including same as effective ingredient US Patent  US9969723 Publication Date 5/15/2018 
Target
Name:
Free fatty acid receptor 1
Synonyms:
FFAR1 G-protein Coupled Receptor 40 | GPR40
Type:
G Protein-Coupled Receptor (GPCR)
Mol. Mass.:
31473.32
Organism:
Homo sapiens (Human)
Description:
O14842
Residue:
300
  
Inhibitor
Name:
BDBM393624
Synonyms:
US9969723, 6
Type:
Small organic molecule
Emp. Form.:
C25H25O4
Mol. Mass.:
389.4641
SMILES:
CC#CC(CC([O-])=O)c1ccc(OCc2cccc(c2)C2=CCC(O)CC2)cc1
: