Target
Amine oxidase [flavin-containing] B
Ligand
BDBM29143
Substrate
BDBM29135
Meas. Tech.
MAO Enzyme Inhibition Assay
pH
7.4±n/a
Temperature
310.15±n/a K
IC50
1410±70 nM
Citation
 Chimenti, FFioravanti, RBolasco, AChimenti, PSecci, DRossi, FYáñez, MOrallo, FOrtuso, FAlcaro, S Chalcones: a valid scaffold for monoamine oxidases inhibitors. J Med Chem 52:2818-24 (2009)  
Target
Name:
Amine oxidase [flavin-containing] B
Synonyms:
AOFB_HUMAN MAOB Monoamine oxidase type B (MAO B) Monoamine oxidase type B (MAOB)
Type:
Protein
Mol. Mass.:
58768.76
Organism:
Homo sapiens (Human)
Description:
P27338
Residue:
520
  
Inhibitor
Name:
BDBM29143
Synonyms:
CHEMBL7976 Chalcone, 13 substituted chalcone, 5j
Type:
Small organic molecule
Emp. Form.:
C15H12O
Mol. Mass.:
208.2552
SMILES:
O=C(\C=C\c1ccccc1)c1ccccc1
:
Substrate
Name:
BDBM29135
Synonyms:
CHEMBL11608 p-Tyramine | tyramine
Type:
Small organic molecule
Emp. Form.:
C8H11NO
Mol. Mass.:
137.179
SMILES:
NCCc1ccc(O)cc1
: