Target
Amine oxidase [flavin-containing] B
Ligand
BDBM29136
Substrate
BDBM29135
Meas. Tech.
MAO Enzyme Inhibition Assay
pH
7.4±n/a
Temperature
310.15±n/a K
IC50
7540±360 nM
Citation
 Chimenti, FFioravanti, RBolasco, AChimenti, PSecci, DRossi, FYáñez, MOrallo, FOrtuso, FAlcaro, S Chalcones: a valid scaffold for monoamine oxidases inhibitors. J Med Chem 52:2818-24 (2009)  
Target
Name:
Amine oxidase [flavin-containing] B
Synonyms:
AOFB_HUMAN MAOB Monoamine oxidase type B (MAO B) Monoamine oxidase type B (MAOB)
Type:
Protein
Mol. Mass.:
58768.76
Organism:
Homo sapiens (Human)
Description:
P27338
Residue:
520
  
Inhibitor
Name:
BDBM29136
Synonyms:
CHEMBL92401 Iprazid | Iproniazid
Type:
Small organic molecule
Emp. Form.:
C9H13N3O
Mol. Mass.:
179.219
SMILES:
CC(C)NNC(=O)c1ccncc1
:
Substrate
Name:
BDBM29135
Synonyms:
CHEMBL11608 p-Tyramine | tyramine
Type:
Small organic molecule
Emp. Form.:
C8H11NO
Mol. Mass.:
137.179
SMILES:
NCCc1ccc(O)cc1
: