Target
Amine oxidase [flavin-containing] A
Ligand
BDBM29171
Substrate
BDBM29135
Meas. Tech.
MAO Enzyme Inhibition Assay
pH
7.4±n/a
Temperature
310.15±n/a K
IC50
9330±730 nM
Citation
 Chimenti, FSecci, DBolasco, AChimenti, PBizzarri, BGranese, ACarradori, SYáñez, MOrallo, FOrtuso, FAlcaro, S Synthesis, molecular modeling, and selective inhibitory activity against human monoamine oxidases of 3-carboxamido-7-substituted coumarins. J Med Chem 52:1935-42 (2009)  
Target
Name:
Amine oxidase [flavin-containing] A
Synonyms:
AOFA_HUMAN MAO-A Monoamine oxidase Monoamine oxidase type A (MAO A) Monoamine oxidase type A (MAOA)
Type:
Protein
Mol. Mass.:
59689.53
Organism:
Homo sapiens (Human)
Description:
P21397
Residue:
527
  
Inhibitor
Name:
BDBM29171
Synonyms:
3-carboxamido coumarin, 21
Type:
Small organic molecule
Emp. Form.:
C17H13NO5S
Mol. Mass.:
343.354
SMILES:
CS(=O)(=O)c1ccc(NC(=O)c2cc3ccccc3oc2=O)cc1
:
Substrate
Name:
BDBM29135
Synonyms:
CHEMBL11608 p-Tyramine | tyramine
Type:
Small organic molecule
Emp. Form.:
C8H11NO
Mol. Mass.:
137.179
SMILES:
NCCc1ccc(O)cc1
: