Target
Amine oxidase [flavin-containing] B
Ligand
BDBM29154
Substrate
BDBM29135
Meas. Tech.
MAO Enzyme Inhibition Assay
IC50
3270±n/a nM
Citation
 Chimenti, FSecci, DBolasco, AChimenti, PBizzarri, BGranese, ACarradori, SYáñez, MOrallo, FOrtuso, FAlcaro, S Synthesis, molecular modeling, and selective inhibitory activity against human monoamine oxidases of 3-carboxamido-7-substituted coumarins. J Med Chem 52:1935-42 (2009)  
Target
Name:
Amine oxidase [flavin-containing] B
Synonyms:
AOFB_HUMAN MAOB Monoamine oxidase type B (MAO B) Monoamine oxidase type B (MAOB)
Type:
Protein
Mol. Mass.:
58768.76
Organism:
Homo sapiens (Human)
Description:
P27338
Residue:
520
  
Inhibitor
Name:
BDBM29154
Synonyms:
3-carboxamido coumarin, 3
Type:
Small organic molecule
Emp. Form.:
C14H15NO3
Mol. Mass.:
245.2738
SMILES:
CC(C)CNC(=O)c1cc2ccccc2oc1=O
:
Substrate
Name:
BDBM29135
Synonyms:
CHEMBL11608 p-Tyramine | tyramine
Type:
Small organic molecule
Emp. Form.:
C8H11NO
Mol. Mass.:
137.179
SMILES:
NCCc1ccc(O)cc1
: