Target
Amine oxidase [flavin-containing] B
Ligand
BDBM29158
Substrate
BDBM29135
Meas. Tech.
MAO Enzyme Inhibition Assay
IC50
600±n/a nM
Citation
 Chimenti, FSecci, DBolasco, AChimenti, PBizzarri, BGranese, ACarradori, SYáñez, MOrallo, FOrtuso, FAlcaro, S Synthesis, molecular modeling, and selective inhibitory activity against human monoamine oxidases of 3-carboxamido-7-substituted coumarins. J Med Chem 52:1935-42 (2009)  
Target
Name:
Amine oxidase [flavin-containing] B
Synonyms:
AOFB_HUMAN MAOB Monoamine oxidase type B (MAO B) Monoamine oxidase type B (MAOB)
Type:
Protein
Mol. Mass.:
58768.76
Organism:
Homo sapiens (Human)
Description:
P27338
Residue:
520
  
Inhibitor
Name:
BDBM29158
Synonyms:
3-carboxamido coumarin, 8
Type:
Small organic molecule
Emp. Form.:
C17H13NO3
Mol. Mass.:
279.29
SMILES:
Cc1cccc(NC(=O)c2cc3ccccc3oc2=O)c1
:
Substrate
Name:
BDBM29135
Synonyms:
CHEMBL11608 p-Tyramine | tyramine
Type:
Small organic molecule
Emp. Form.:
C8H11NO
Mol. Mass.:
137.179
SMILES:
NCCc1ccc(O)cc1
: