Target
Metabotropic glutamate receptor 2
Ligand
BDBM393777
Substrate
Meas. Tech.
In Vitro GIRK Thallium Flux Assay (60 minutes)
EC50
>10000±n/a nM
Citation
 Cosford, NDRaveendra-Panickar, DSheffler, DJ Metabotropic glutamate receptor negative allosteric modulators (NAMS) and uses thereof US Patent  US9969726 Publication Date 5/15/2018 
Target
Name:
Metabotropic glutamate receptor 2
Synonyms:
GRM2_RAT Grm2 | Mglur2
Type:
PROTEIN
Mol. Mass.:
95786.41
Organism:
Rattus norvegicus
Description:
ChEMBL_105034
Residue:
872
  
Inhibitor
Name:
BDBM393777
Synonyms:
US10597367, Example 66 | US9969726, Example 66
Type:
Small organic molecule
Emp. Form.:
C27H19N3O2
Mol. Mass.:
417.4587
SMILES:
OC(=O)c1cccc(c1)-c1cccc(c1)-c1nc(nn1-c1ccccc1)-c1ccccc1
: