Target
Metabotropic glutamate receptor 2
Ligand
BDBM393795
Substrate
Meas. Tech.
In Vitro GIRK Thallium Flux Assay (2.5 minutes)
EC50
2790±n/a nM
Citation
 Cosford, NDRaveendra-Panickar, DSheffler, DJ Metabotropic glutamate receptor negative allosteric modulators (NAMS) and uses thereof US Patent  US9969726 Publication Date 5/15/2018 
Target
Name:
Metabotropic glutamate receptor 2
Synonyms:
GRM2_RAT Grm2 | Mglur2
Type:
PROTEIN
Mol. Mass.:
95786.41
Organism:
Rattus norvegicus
Description:
ChEMBL_105034
Residue:
872
  
Inhibitor
Name:
BDBM393795
Synonyms:
US10597367, Example 84 | US9969726, Example 84
Type:
Small organic molecule
Emp. Form.:
C24H12F7N3O2
Mol. Mass.:
507.3598
SMILES:
OC(=O)c1cc(F)cc(c1)-c1ccc(cc1)-c1nc(cc(n1)C(F)(F)F)-c1ccc(nc1)C(F)(F)F
: