Target
D(3) dopamine receptor
Ligand
BDBM301891
Substrate
Meas. Tech.
Radioligand Binding Assay
Ki
18.0±3.0 nM
Citation
 Ananthan, S Urea and amide derivatives of aminoalkylpiperazines and use thereof US Patent  US9969743 Publication Date 5/15/2018 
Target
Name:
D(3) dopamine receptor
Synonyms:
DOPAMINE D3 DRD3_HUMAN Dopamine D3 receptor (D3) Dopamine receptor Dopamine receptor D3
Type:
Mol. Mass.:
44243.43
Organism:
Homo sapiens (Human)
Description:
Residue:
400
  
Inhibitor
Name:
BDBM301891
Synonyms:
N-(4-(4-(2-(tert-Butyl)-6-(trifluoromethyl)pyrimidin-4-yl)piperazin-1-yl)butyl)-4-(1-methylpiperidin-4-yl)piperazine-1-carboxamide US9969743, 76
Type:
Small organic molecule
Emp. Form.:
C28H47F3N8O
Mol. Mass.:
568.721
SMILES:
CN1CCC(CC1)N1CCN(CC1)C(=O)NCCCCN1CCN(CC1)c1cc(nc(n1)C(C)(C)C)C(F)(F)F
: