Target
Interleukin-1 receptor-associated kinase 4
Ligand
BDBM393909
Substrate
Meas. Tech.
Kinase Assay
IC50
11.0±n/a nM
Citation
 Altman, MDAndresen, BMBrubaker, JDChilders, MLDonofrio, AFischmann, TGibeau, CRKattar, SDLesburg, CALim, JMacLean, JKMansoor, UFNorthrup, ABSanders, JMTorres, L Inhibitors of IRAK4 activity US Patent  US9969749 Publication Date 5/15/2018 
Target
Name:
Interleukin-1 receptor-associated kinase 4
Synonyms:
IRAK-4 IRAK4_HUMAN Interleukin-1 receptor-associated kinase 4 (IRAK4) | Renal carcinoma antigen NY-REN-64
Type:
Protein
Mol. Mass.:
51519.08
Organism:
Homo sapiens (Human)
Description:
Q9NWZ3
Residue:
460
  
Inhibitor
Name:
BDBM393909
Synonyms:
US9969749, Example 1-3 cis or trans-N,N- dimethyl-N''-[6-(pyridin- 4-yl)quinazolin-4- yl]cyclohexane-1,4- diamine
Type:
Small organic molecule
Emp. Form.:
C21H25N5
Mol. Mass.:
347.4567
SMILES:
CN(C)C1CCC(CC1)Nc1ncnc2ccc(cc12)-c1ccncc1
: