Target
Interleukin-1 receptor-associated kinase 4
Ligand
BDBM393946
Substrate
Meas. Tech.
Kinase Assay
IC50
43.0±n/a nM
Citation
 Altman, MDAndresen, BMBrubaker, JDChilders, MLDonofrio, AFischmann, TGibeau, CRKattar, SDLesburg, CALim, JMacLean, JKMansoor, UFNorthrup, ABSanders, JMTorres, L Inhibitors of IRAK4 activity US Patent  US9969749 Publication Date 5/15/2018 
Target
Name:
Interleukin-1 receptor-associated kinase 4
Synonyms:
IRAK-4 IRAK4_HUMAN Interleukin-1 receptor-associated kinase 4 (IRAK4) | Renal carcinoma antigen NY-REN-64
Type:
Protein
Mol. Mass.:
51519.08
Organism:
Homo sapiens (Human)
Description:
Q9NWZ3
Residue:
460
  
Inhibitor
Name:
BDBM393946
Synonyms:
3-(4-{[trans-4- (dimethylamino)cyclohexyl] amino}quinazolin-6- yl)pyridine-2- carbonitrile | US9969749, Example 1-39
Type:
Small organic molecule
Emp. Form.:
C22H24N6
Mol. Mass.:
372.4662
SMILES:
CN(C)[C@H]1CC[C@@H](CC1)Nc1ncnc2ccc(cc12)-c1cccnc1C#N
: