Target
Interleukin-1 receptor-associated kinase 4
Ligand
BDBM394052
Substrate
Meas. Tech.
Kinase Assay
IC50
1.000±n/a nM
Citation
 Altman, MDAndresen, BMBrubaker, JDChilders, MLDonofrio, AFischmann, TGibeau, CRKattar, SDLesburg, CALim, JMacLean, JKMansoor, UFNorthrup, ABSanders, JMTorres, L Inhibitors of IRAK4 activity US Patent  US9969749 Publication Date 5/15/2018 
Target
Name:
Interleukin-1 receptor-associated kinase 4
Synonyms:
IRAK-4 IRAK4_HUMAN Interleukin-1 receptor-associated kinase 4 (IRAK4) | Renal carcinoma antigen NY-REN-64
Type:
Protein
Mol. Mass.:
51519.08
Organism:
Homo sapiens (Human)
Description:
Q9NWZ3
Residue:
460
  
Inhibitor
Name:
BDBM394052
Synonyms:
5-(4-{[trans-4-(3- methoxyazetidin-1- yl)cyclohexyl]amino} quinazolin-6-yl)pyridin-3-ol | US9969749, Example 5-2
Type:
Small organic molecule
Emp. Form.:
C23H27N5O2
Mol. Mass.:
405.4928
SMILES:
COC1CN(C1)[C@H]1CC[C@@H](CC1)Nc1ncnc2ccc(cc12)-c1cncc(O)c1
: