Target
5-hydroxytryptamine receptor 6
Ligand
BDBM394095
Substrate
Meas. Tech.
Radioligand Binding Assay
Ki
17.0±n/a nM
Citation
 Zhang, YJin, CZhong, WChen, KGao, LLiu, RZhang, J Aromatic heterocyclic derivatives and pharmaceutical applications thereof US Patent  US9974785 Publication Date 5/22/2018 
Target
Name:
5-hydroxytryptamine receptor 6
Synonyms:
5-HT-6 5-hydroxytryptamine receptor 6 (5-HT-6) 5-hydroxytryptamine receptor 6 (5HT6) HTR6 Serotonin 6 (5-HT6) receptor | Serotonin Receptor 6
Type:
G Protein-Coupled Receptor (GPCR)
Mol. Mass.:
46968.43
Organism:
Homo sapiens (Human)
Description:
P50406
Residue:
440
  
Inhibitor
Name:
BDBM394095
Synonyms:
US9974785, Example 15
Type:
Small organic molecule
Emp. Form.:
C20H21F2N3O2S
Mol. Mass.:
405.461
SMILES:
Cc1ccc(cc1)S(=O)(=O)n1cc(C(F)F)c2cc(ccc12)N1CCNCC1
: