Target
5-hydroxytryptamine receptor 6
Ligand
BDBM394116
Substrate
Meas. Tech.
Radioligand Binding Assay
Ki
11.0±n/a nM
Citation
 Zhang, YJin, CZhong, WChen, KGao, LLiu, RZhang, J Aromatic heterocyclic derivatives and pharmaceutical applications thereof US Patent  US9974785 Publication Date 5/22/2018 
Target
Name:
5-hydroxytryptamine receptor 6
Synonyms:
5-HT-6 5-hydroxytryptamine receptor 6 (5-HT-6) 5-hydroxytryptamine receptor 6 (5HT6) HTR6 Serotonin 6 (5-HT6) receptor | Serotonin Receptor 6
Type:
G Protein-Coupled Receptor (GPCR)
Mol. Mass.:
46968.43
Organism:
Homo sapiens (Human)
Description:
P50406
Residue:
440
  
Inhibitor
Name:
BDBM394116
Synonyms:
US9974785, Example 54
Type:
Small organic molecule
Emp. Form.:
C20H20BrF2N3O2S
Mol. Mass.:
484.358
SMILES:
FC(F)c1cn(c2cccc(NC3CCNCC3)c12)S(=O)(=O)c1cccc(Br)c1
: