Target
Bile acid receptor
Ligand
BDBM76996
Substrate
Meas. Tech.
Glycocholic acid Uptake Radiometric Assay
IC50
0.39±n/a nM
Citation
 Gillberg, PGraffner, HStarke, I IBAT inhibitors for the treatment of liver disease US Patent  US9694018 Publication Date 7/4/2017 
Target
Name:
Bile acid receptor
Synonyms:
BAR FXR HRR1 NR1H4_HUMAN RIP14 Retinoid X receptor-interacting protein 14 | farnesoid x receptor
Type:
Nuclear Receptor
Mol. Mass.:
55916.24
Organism:
Homo sapiens (Human)
Description:
Q96RI1
Residue:
486
  
Inhibitor
Name:
BDBM76996
Synonyms:
US10487111, Example 2. | US9694018, 2
Type:
Small organic molecule
Emp. Form.:
C37H47N3O7S2
Mol. Mass.:
709.915
SMILES:
CCCCC1(CCCC)CN(c2ccccc2)c2cc(SC)c(OCC(=O)N[C@@H](C(=O)N[C@@H](C)C(O)=O)c3ccccc3)cc2S(=O)(=O)C1
: