Target
Beta-secretase 1
Ligand
BDBM394123
Substrate
Meas. Tech.
Inhibition Assay
IC50
8130±n/a nM
Citation
 Cavalli, APrati, FBottegoni, GFavia, ADPizzirani, DScarpelli, RBolognesi, ML Dual inhibitor compounds for use in the treatment of neurodegenerative disorders and alzheimer''s disease US Patent  US9975861 Publication Date 5/22/2018 
Target
Name:
Beta-secretase 1
Synonyms:
ASP2 Aspartyl protease 2 BACE1 Beta-secretase (BACE) Beta-secretase 1 (BACE 1) Beta-secretase 1 (BACE1) Beta-site amyloid precursor protein cleaving enzyme 1 Memapsin-2 beta-Secretase (BACE-1) | beta-Secretase (BACE1)
Type:
Protein
Mol. Mass.:
55755.10
Organism:
Homo sapiens (Human)
Description:
P56817
Residue:
501
  
Inhibitor
Name:
BDBM394123
Synonyms:
US9975861, 3 US9975861, 5
Type:
Small organic molecule
Emp. Form.:
C11H13FN4O
Mol. Mass.:
236.2455
SMILES:
CCNC1=NC(NC(=O)N1)c1ccc(F)cc1
: