Target
Beta-carbonic anhydrase 1
Ligand
BDBM10875
Substrate
BDBM10856
Meas. Tech.
CA Inhibition Assay
pH
8.3±n/a
Temperature
293.15±n/a K
Ki
7480±n/a nM
Citation
 Minakuchi, TNishimori, IVullo, DScozzafava, ASupuran, CT Molecular cloning, characterization, and inhibition studies of the Rv1284 beta-carbonic anhydrase from Mycobacterium tuberculosis with sulfonamides and a sulfamate. J Med Chem 52:2226-32 (2009)  
Target
Name:
Beta-carbonic anhydrase 1
Synonyms:
β-Carbonic anhydrase 1 (CA 1) MTCA1_MYCTU canA | mtcA1
Type:
Enzyme
Mol. Mass.:
18186.06
Organism:
Mycobacterium tuberculosis
Description:
The recombinant GST-mtCA1 construct was cloned, expressed, and further purified from E. coli. The purified protein was used in inhibition assays.
Residue:
163
  
Inhibitor
Name:
BDBM10875
Synonyms:
5-(2-chlorophenyl)-1,3,4-thiadiazole-2-sulfonamide Chlorzolamide, CHL JMC523116 Compound 19 | aromatic/heteroaromatic sulfonamide 20
Type:
Small organic molecule
Emp. Form.:
C8H6ClN3O2S2
Mol. Mass.:
275.735
SMILES:
NS(=O)(=O)c1nnc(s1)-c1ccccc1Cl
:
Substrate
Name:
BDBM10856
Synonyms:
Carbon Dioxide | methanedione
Type:
Small organic molecule
Emp. Form.:
CO2
Mol. Mass.:
44.0095
SMILES:
O=C=O
: