Target
Beta-carbonic anhydrase 1
Ligand
BDBM4703
Substrate
BDBM10856
Meas. Tech.
CA Inhibition Assay
pH
8.3±n/a
Temperature
293.15±n/a K
Ki
8210±n/a nM
Citation
 Minakuchi, TNishimori, IVullo, DScozzafava, ASupuran, CT Molecular cloning, characterization, and inhibition studies of the Rv1284 beta-carbonic anhydrase from Mycobacterium tuberculosis with sulfonamides and a sulfamate. J Med Chem 52:2226-32 (2009)  
Target
Name:
Beta-carbonic anhydrase 1
Synonyms:
β-Carbonic anhydrase 1 (CA 1) MTCA1_MYCTU canA | mtcA1
Type:
Enzyme
Mol. Mass.:
18186.06
Organism:
Mycobacterium tuberculosis
Description:
The recombinant GST-mtCA1 construct was cloned, expressed, and further purified from E. coli. The purified protein was used in inhibition assays.
Residue:
163
  
Inhibitor
Name:
BDBM4703
Synonyms:
4-carboxybenzenesulfonamide 1 Benzoic Acid deriv. 31 JMC522226 Compound 22 JMC52646 Compound 23 | aromatic/heteroaromatic sulfonamide 23
Type:
Small organic molecule
Emp. Form.:
C7H7NO4S
Mol. Mass.:
201.2
SMILES:
NS(=O)(=O)c1ccc(cc1)C(O)=O
:
Substrate
Name:
BDBM10856
Synonyms:
Carbon Dioxide | methanedione
Type:
Small organic molecule
Emp. Form.:
CO2
Mol. Mass.:
44.0095
SMILES:
O=C=O
: