Target
Plasma kallikrein
Ligand
BDBM394143
Substrate
Meas. Tech.
Kallikrein Assay
IC50
178±n/a nM
Citation
 Mertz, EEdmondson, SDHruza, AHe, JSo, SAli, AGao, Y Factor XIa inhibitors US Patent  US9975874 Publication Date 5/22/2018 
Target
Name:
Plasma kallikrein
Synonyms:
Fletcher factor KLKB1 Kallikrein Plasma kallikrein heavy chain Plasma prekallikrein
Type:
Protein
Mol. Mass.:
71391.16
Organism:
Homo sapiens (Human)
Description:
P03952
Residue:
638
  
Inhibitor
Name:
BDBM394143
Synonyms:
US9975874, Example 16
Type:
Small organic molecule
Emp. Form.:
C33H24ClFN6O2
Mol. Mass.:
591.034
SMILES:
NC(=O)c1cccc(c1)-c1cc(F)cc(c1)[C@H](Cc1ccccc1)c1ccc(c[n+]1[O-])-c1cc(Cl)ccc1-n1cnnn1
: