Target
Coagulation factor XI
Ligand
BDBM394144
Substrate
Meas. Tech.
Inhibition Assay
IC50
12.0±n/a nM
Citation
 Mertz, EEdmondson, SDHruza, AHe, JSo, SAli, AGao, Y Factor XIa inhibitors US Patent  US9975874 Publication Date 5/22/2018 
Target
Name:
Coagulation factor XI
Synonyms:
Coagulation factor XIa Coagulation factor XIa light chain FA11_HUMAN Factor XIa PTA | Plasma thromboplastin antecedent
Type:
Enzyme
Mol. Mass.:
70130.58
Organism:
Homo sapiens (Human)
Description:
P03951
Residue:
625
  
Inhibitor
Name:
BDBM394144
Synonyms:
US9975874, Example 17 US9975874, Example 19
Type:
Small organic molecule
Emp. Form.:
C30H24ClN5O3
Mol. Mass.:
537.996
SMILES:
OC(=O)c1cccc(c1)-c1cccc(c1)C(CC1CC1)c1ccc(c[n+]1[O-])-c1cc(Cl)ccc1-n1cnnn1
: