Target
Coagulation factor XI
Ligand
BDBM394163
Substrate
Meas. Tech.
Inhibition Assay
IC50
21.2±n/a nM
Citation
 Mertz, EEdmondson, SDHruza, AHe, JSo, SAli, AGao, Y Factor XIa inhibitors US Patent  US9975874 Publication Date 5/22/2018 
Target
Name:
Coagulation factor XI
Synonyms:
Coagulation factor XIa Coagulation factor XIa light chain FA11_HUMAN Factor XIa PTA | Plasma thromboplastin antecedent
Type:
Enzyme
Mol. Mass.:
70130.58
Organism:
Homo sapiens (Human)
Description:
P03951
Residue:
625
  
Inhibitor
Name:
BDBM394163
Synonyms:
5-[5-chloro-2- (1H-tetrazol- 1-yl)phenyl]- 2-[(1S)-1-{3- [1- (difluoroacetyl) piperidin-4- yl]phenyl}-2- phenylethyl] pyridine 1- oxide | US9975874, Example 37
Type:
Small organic molecule
Emp. Form.:
C33H30ClF2N6O
Mol. Mass.:
600.08
SMILES:
FC(F)C(=O)N1CCC(CC1)c1cccc(c1)[C@H](Cc1ccccc1)c1ccc(c[nH+]1)-c1cc(Cl)ccc1-n1cnnn1
: