Target
Coagulation factor XI
Ligand
BDBM394164
Substrate
Meas. Tech.
Inhibition Assay
IC50
10.9±n/a nM
Citation
 Mertz, EEdmondson, SDHruza, AHe, JSo, SAli, AGao, Y Factor XIa inhibitors US Patent  US9975874 Publication Date 5/22/2018 
Target
Name:
Coagulation factor XI
Synonyms:
Coagulation factor XIa Coagulation factor XIa light chain FA11_HUMAN Factor XIa PTA | Plasma thromboplastin antecedent
Type:
Enzyme
Mol. Mass.:
70130.58
Organism:
Homo sapiens (Human)
Description:
P03951
Residue:
625
  
Inhibitor
Name:
BDBM394164
Synonyms:
5-[5-chloro-2- (1H-tetrazol- 1-yl)phenyl]- 2-[(1S)-1-{3- [1- (fluoroacetyl) piperidin-4- yl]phenyl}-2- phenylethyl] pyridine 1- oxide | US9975874, Example 38
Type:
Small organic molecule
Emp. Form.:
C33H31ClFN6O
Mol. Mass.:
582.09
SMILES:
FCC(=O)N1CCC(CC1)c1cccc(c1)[C@H](Cc1ccccc1)c1ccc(c[nH+]1)-c1cc(Cl)ccc1-n1cnnn1
: