Target
Coagulation factor XI
Ligand
BDBM394173
Substrate
Meas. Tech.
Inhibition Assay
IC50
20.1±n/a nM
Citation
 Mertz, EEdmondson, SDHruza, AHe, JSo, SAli, AGao, Y Factor XIa inhibitors US Patent  US9975874 Publication Date 5/22/2018 
Target
Name:
Coagulation factor XI
Synonyms:
Coagulation factor XIa Coagulation factor XIa light chain FA11_HUMAN Factor XIa PTA | Plasma thromboplastin antecedent
Type:
Enzyme
Mol. Mass.:
70130.58
Organism:
Homo sapiens (Human)
Description:
P03951
Residue:
625
  
Inhibitor
Name:
BDBM394173
Synonyms:
4-{3-[(1S)-1- {5-[5-chloro-2- (1H-tetrazol- 1-yl)phenyl]-1- oxidopyridin- 2-yl}-2- phenylethyl] phenyl}-N- cyclopentyl piperidine-1- carboxamide | US9975874, Example 47
Type:
Small organic molecule
Emp. Form.:
C37H38ClN7O2
Mol. Mass.:
648.196
SMILES:
[O-][n+]1cc(ccc1[C@@H](Cc1ccccc1)c1cccc(c1)C1CCN(CC1)C(=O)NC1CCCC1)-c1cc(Cl)ccc1-n1cnnn1
: