Target
Orexin/Hypocretin receptor type 1
Ligand
BDBM394180
Substrate
Meas. Tech.
FLIPR Ca2+ Flux Assay
IC50
2896±n/a nM
Citation
 Kuduk, SDSkudlarek, JW 2-pyridyloxy-3-ester-4-ether orexin receptor antagonists US Patent  US9975876 Publication Date 5/22/2018 
Target
Name:
Orexin/Hypocretin receptor type 1
Synonyms:
HCRTR1 OX1R_HUMAN Orexin receptor type 1 (OR 1) Orexin receptor type 1 (OX1) Orexin receptor type 1 (OxR1) | Ox1r
Type:
Protein
Mol. Mass.:
47554.50
Organism:
Homo sapiens (Human)
Description:
O43613
Residue:
425
  
Inhibitor
Name:
BDBM394180
Synonyms:
US9975876, 19 | US9975876, 2
Type:
Small organic molecule
Emp. Form.:
C23H24FN5O5
Mol. Mass.:
469.4656
SMILES:
COC(=O)c1c(OC)ccnc1O[C@@H]1CC[C@@H](C)N(C1)C(=O)c1cccc(F)c1-n1nccn1
: