Target
Orexin/Hypocretin receptor type 1
Ligand
BDBM394191
Substrate
Meas. Tech.
FLIPR Ca2+ Flux Assay
IC50
1164±n/a nM
Citation
 Kuduk, SDSkudlarek, JW 2-pyridyloxy-3-ester-4-ether orexin receptor antagonists US Patent  US9975876 Publication Date 5/22/2018 
Target
Name:
Orexin/Hypocretin receptor type 1
Synonyms:
HCRTR1 OX1R_HUMAN Orexin receptor type 1 (OR 1) Orexin receptor type 1 (OX1) Orexin receptor type 1 (OxR1) | Ox1r
Type:
Protein
Mol. Mass.:
47554.50
Organism:
Homo sapiens (Human)
Description:
O43613
Residue:
425
  
Inhibitor
Name:
BDBM394191
Synonyms:
US9975876, 13 | methyl 2-{[(3R,6R)-1-{[5-fluoro-2- (3-methyl-1,2,4-oxadiazol-5- yl)phenyl]carbonyl}-6- methylpiperidin-3-yl]oxy}-4- methoxypyridine-3-carboxylate
Type:
Small organic molecule
Emp. Form.:
C24H25FN4O6
Mol. Mass.:
484.4769
SMILES:
COC(=O)c1c(OC)ccnc1O[C@@H]1CC[C@@H](C)N(C1)C(=O)c1cc(F)ccc1-c1nc(C)no1
: