Target
Orexin receptor type 2
Ligand
BDBM394206
Substrate
Meas. Tech.
FLIPR Ca2+ Flux Assay
IC50
25.0±n/a nM
Citation
 Kuduk, SDSkudlarek, JW 2-pyridyloxy-3-ester-4-ether orexin receptor antagonists US Patent  US9975876 Publication Date 5/22/2018 
Target
Name:
Orexin receptor type 2
Synonyms:
HCRTR2 OX2R_HUMAN Orexin receptor type 2 (OR-2) Orexin receptor type 2 (OX2R) Ox-2-R | Ox2-R
Type:
Protein
Mol. Mass.:
50710.53
Organism:
Homo sapiens (Human)
Description:
O43614
Residue:
444
  
Inhibitor
Name:
BDBM394206
Synonyms:
US9975876, 31
Type:
Small organic molecule
Emp. Form.:
C24H26N4O5
Mol. Mass.:
450.487
SMILES:
COC(=O)c1c(OC)cccc1O[C@@H]1CC[C@@H](C)N(C1)C(=O)c1ccccc1-n1nccn1
: