Target
Androgen receptor
Ligand
BDBM29326
Substrate
BDBM18161
Meas. Tech.
Receptor Binding Assay (Ki) and Transactivation Assay (EC50)
pH
7.6±n/a
Temperature
295.15±n/a K
Ki
1.9±0.1 nM
EC50
44±n/a nM
Citation
 Nirschl, AAZou, YKrystek, SRSutton, JCSimpkins, LMLupisella, JAKuhns, JESeethala, RGolla, RSleph, PGBeehler, BCGrover, GJEgan, DFura, AVyas, VPLi, YXSack, JSKish, KFAn, YBryson, JAGougoutas, JZDiMarco, JZahler, ROstrowski, JHamann, LG N-aryl-oxazolidin-2-imine muscle selective androgen receptor modulators enhance potency through pharmacophore reorientation. J Med Chem 52:2794-8 (2009)  
Target
Name:
Androgen receptor
Synonyms:
ANDR_HUMAN Androgen Receptor Androgen receptor/Baculoviral IAP repeat-containing protein 2 Dihydrotestosterone receptor Nuclear receptor subfamily 3 group C member 4
Type:
Receptor
Mol. Mass.:
99185.27
Organism:
Homo sapiens (Human)
Description:
CHO cells were stably transfected with human AR gene.
Residue:
920
  
Inhibitor
Name:
BDBM29326
Synonyms:
guanidine derivative, 12
Type:
Small organic molecule
Emp. Form.:
C15H17ClN4O
Mol. Mass.:
304.775
SMILES:
[H][C@]12CN(C)\C(=N/c3ccc(C#N)c(Cl)c3C)N1CC[C@H]2O
:
Substrate
Name:
BDBM18161
Synonyms:
(1S,2S,7S,10R,11S,14S,15S)-14-hydroxy-2,15-dimethyltetracyclo[8.7.0.0^{2,7}.0^{11,15}]heptadecan-5-one CHEMBL27769 Dihydrotestosterone | [3H]DHT
Type:
Steroid
Emp. Form.:
C19H30O2
Mol. Mass.:
290.4403
SMILES:
[H][C@@]12CC[C@H](O)[C@@]1(C)CC[C@@]1([H])[C@@]2([H])CC[C@@]2([H])CC(=O)CC[C@]12C
: