Target
Tyrosine-protein kinase BTK
Ligand
BDBM394256
Substrate
Meas. Tech.
Lanthscreen Eu Kinase Binding Assay
IC50
0.500±n/a nM
Citation
 Bosanac, TBentzien, JBurke, MJFryer, RMLarson, ETMao, WMcKibben, BPShen, YSoleymanzadeh, FTschantz, MA Heteroaromatic compounds as BTK inhibitors US Patent  US9975882 Publication Date 5/22/2018 
Target
Name:
Tyrosine-protein kinase BTK
Synonyms:
AGMX1 Agammaglobulinaemia tyrosine kinase B cell progenitor kinase BPK BTK_HUMAN Tyrosine Kinase BTK Tyrosine-protein kinase BTK (BTK)
Type:
Enzyme
Mol. Mass.:
76289.95
Organism:
Homo sapiens (Human)
Description:
Q06187
Residue:
659
  
Inhibitor
Name:
BDBM394256
Synonyms:
US9975882, Example 47
Type:
Small organic molecule
Emp. Form.:
C25H24F3N7O2
Mol. Mass.:
511.499
SMILES:
CC#CC(=O)N1CC2(CC(C2)n2nc(-c3cnn(Cc4cccc(c4)C(F)(F)F)c3)c(C(N)=O)c2N)C1
: