Target
Tyrosine-protein kinase BTK
Ligand
BDBM394262
Substrate
Meas. Tech.
Lanthscreen Eu Kinase Binding Assay
IC50
1.30±n/a nM
Citation
 Bosanac, TBentzien, JBurke, MJFryer, RMLarson, ETMao, WMcKibben, BPShen, YSoleymanzadeh, FTschantz, MA Heteroaromatic compounds as BTK inhibitors US Patent  US9975882 Publication Date 5/22/2018 
Target
Name:
Tyrosine-protein kinase BTK
Synonyms:
AGMX1 Agammaglobulinaemia tyrosine kinase B cell progenitor kinase BPK BTK_HUMAN Tyrosine Kinase BTK Tyrosine-protein kinase BTK (BTK)
Type:
Enzyme
Mol. Mass.:
76289.95
Organism:
Homo sapiens (Human)
Description:
Q06187
Residue:
659
  
Inhibitor
Name:
BDBM394262
Synonyms:
US9975882, Example 53
Type:
Small organic molecule
Emp. Form.:
C25H25ClFN7O2
Mol. Mass.:
509.963
SMILES:
CC#CC(=O)N1CC[C@@]2(C[C@@H](C2)n2nc(-c3cnn(Cc4cccc(F)c4Cl)c3)c(C(N)=O)c2N)C1
: