Target
Tyrosine-protein kinase Tec
Ligand
BDBM394263
Substrate
Meas. Tech.
Lanthscreen Eu Kinase Binding Assay
IC50
35.0±n/a nM
Citation
 Bosanac, TBentzien, JBurke, MJFryer, RMLarson, ETMao, WMcKibben, BPShen, YSoleymanzadeh, FTschantz, MA Heteroaromatic compounds as BTK inhibitors US Patent  US9975882 Publication Date 5/22/2018 
Target
Name:
Tyrosine-protein kinase Tec
Synonyms:
PSCTK4 TEC_HUMAN | Tyrosine-protein kinase TEC (TEC)
Type:
Protein
Mol. Mass.:
73597.00
Organism:
Homo sapiens (Human)
Description:
Residue:
631
  
Inhibitor
Name:
BDBM394263
Synonyms:
US9975882, Example 54
Type:
Small organic molecule
Emp. Form.:
C25H26ClN7O2
Mol. Mass.:
491.973
SMILES:
CC#CC(=O)N1CC[C@@]2(C[C@@H](C2)n2nc(-c3cnn(Cc4ccccc4Cl)c3)c(C(N)=O)c2N)C1
: