Target
Cholinesterase
Ligand
BDBM29402
Substrate
BDBM8978
Meas. Tech.
Measurement of hBuChE Activity
pH
7.2±n/a
Temperature
295.15±n/a K
IC50
>100000±n/a nM
Citation
 Marco-Contelles, JLeón, Rde los Ríos, CSamadi, ABartolini, MAndrisano, VHuertas, OBarril, XLuque, FJRodríguez-Franco, MILópez, BLópez, MGGarcía, AGCarreiras Mdo, CVillarroya, M Tacripyrines, the first tacrine-dihydropyridine hybrids, as multitarget-directed ligands for the treatment of Alzheimer's disease. J Med Chem 52:2724-32 (2009)  
Target
Name:
Cholinesterase
Synonyms:
Acylcholine acylhydrolase Butyrylcholine esterase (BChE) Butyrylcholinesterase (BuChE) CHLE_HUMAN Cholinesterases Pseudocholinesterase
Type:
Homotetramer
Mol. Mass.:
68422.27
Organism:
Homo sapiens (Human)
Description:
P06276
Residue:
602
  
Inhibitor
Name:
BDBM29402
Synonyms:
tacrine-dihydropyridine hybrid (tacripyrine), 13
Type:
Small organic molecule
Emp. Form.:
C21H24N4O2
Mol. Mass.:
364.4409
SMILES:
CCOC(=O)C1C(c2cccnc2)c2c(N)c3CCCCc3nc2N=C1C
:
Substrate
Name:
BDBM8978
Synonyms:
(Propylcarbonylthioethyl)trimethylammonium iodide CHEMBL148530 butyrylthiocholine | butyrylthiocholine chloride
Type:
Small organic molecule
Emp. Form.:
C9H20NOS
Mol. Mass.:
190.326
SMILES:
CCCC(=O)SCC[N+](C)(C)C
: