Target
Phosphatidylinositol 4,5-bisphosphate 3-kinase catalytic subunit delta isoform
Ligand
BDBM394283
Substrate
Meas. Tech.
PI3Kdelta Scintillation Proximity Assay A3
IC50
<50±n/a nM
Citation
 Li, YMetcalf, BWCombs, AP Pyrimidinones as PI3K inhibitors US Patent  US9975907 Publication Date 5/22/2018 
Target
Name:
Phosphatidylinositol 4,5-bisphosphate 3-kinase catalytic subunit delta isoform
Synonyms:
PI3-kinase p110 subunit delta PI3-kinase subunit p110-delta PIK3CD Phosphatidylinositol 4,5-biphosphate 3-kinase catalytic subunit delta (PIK3CD) Phosphatidylinositol 4,5-bisphosphate 3-kinase 110 kDa catalytic subunit delta (PI3K delta) Phosphatidylinositol 4,5-bisphosphate 3-kinase catalytic subunit delta (PI3Kdelta) Phosphatidylinositol 4,5-bisphosphate 3-kinase catalytic subunit delta isoform (PI3K delta) Phosphatidylinositol 4,5-bisphosphate 3-kinase catalytic subunit delta isoform (PI3K-delta) Phosphatidylinositol 4,5-bisphosphate 3-kinase catalytic subunit delta isoform (PI3Kdelta)
Type:
Enzyme Subunit
Mol. Mass.:
119489.41
Organism:
Homo sapiens (Human)
Description:
O00329
Residue:
1044
  
Inhibitor
Name:
BDBM394283
Synonyms:
US10428087, Example 2 US11401280, Example 2 | US9975907, Example 2
Type:
Small organic molecule
Emp. Form.:
C23H21N7O
Mol. Mass.:
411.4591
SMILES:
CCC(Nc1ncnc2[nH]cnc12)c1nc2cccc(C)n2c(=O)c1-c1ccccc1
: