Target
Protein arginine N-methyltransferase 5
Ligand
BDBM394817
Substrate
Meas. Tech.
PRMT5 Biochemical Assay
IC50
<100±n/a nM
Citation
 Duncan, KWChesworth, RBoriack-Sjodin, PAMunchhof, MJJin, L Tetrahydro- and dihydro-isoquinoline PRMT5 inhibitors and uses thereof US Patent  US10307413 Publication Date 6/4/2019 
Target
Name:
Protein arginine N-methyltransferase 5
Synonyms:
Human Flag-PRMT5/6His-MeP50 protein | PRMT5/MeP50
Type:
Protein
Mol. Mass.:
Description:
Components:
This complex has 2 components.
Component 1
Name:
Protein arginine N-methyltransferase 5
Synonyms:
ANM5_HUMAN HRMT1L5 JBP1 Protein arginine N-methyltransferase 5 (Flag-PRMT5) | SKB1
Type:
Protein
Mol. Mass.:
72548.80
Organism:
Homo sapiens (Human)
Description:
Full-length PRMT5 with FLAG tag fused directly to Ala 2 (MDYKDDDDK removed)
Residue:
636
  
Component 2
Name:
Protein arginine N-methyltransferase 5
Synonyms:
6His-MEP50 HRMT1L5 JBP1 PRMT5 | SKB1
Type:
Protein
Mol. Mass.:
37539.24
Organism:
Homo sapiens (Human)
Description:
Full-length MeP50 with His tag fused directly to Arg 2 of MEP50
Residue:
348
  
Inhibitor
Name:
BDBM394817
Synonyms:
US10307413, Compound 465
Type:
Small organic molecule
Emp. Form.:
C21H27N5O4
Mol. Mass.:
413.4702
SMILES:
COc1nc(NC2COC2)cc(n1)C(=O)NC[C@H](O)CN1CCc2ccccc2C1
: