Target
RAC-alpha serine/threonine-protein kinase
Ligand
BDBM29518
Substrate
Biotinylated GSK3 alpha Substrate Peptide
Meas. Tech.
Homogeneous Time-Resolved Fluorescence Resonance Energy Transfer Lance Assay
pH
7.4±n/a
Temperature
295.15±n/a K
IC50
163±n/a nM
Citation
 Salaski, EJKrishnamurthy, GDing, WDYu, KInsaf, SSEid, CShim, JLevin, JITabei, KToral-Barza, LZhang, WGMcDonald, LAHonores, EHanna, CYamashita, AJohnson, BLi, ZLaakso, LPowell, DMansour, TS Pyranonaphthoquinone lactones: a new class of AKT selective kinase inhibitors alkylate a regulatory loop cysteine. J Med Chem 52:2181-4 (2009)  
Target
Name:
RAC-alpha serine/threonine-protein kinase
Synonyms:
AKT phosphorylation (p-AKT) AKT1/PPP1CA C-AKT PKB alpha Protein kinase B Protein kinase B (Akt 1) Protein kinase B alpha Proto-oncogene Akt (Akt1) Proto-oncogene c-Akt (AKT1) RAC-PK-alpha RAC-alpha serine/threonine-protein kinase (AKT1) | RAC-alpha serine/threonine-protein kinase (pAKT)
Type:
Enzyme
Mol. Mass.:
55681.25
Organism:
Homo sapiens (Human)
Description:
P31749
Residue:
480
  
Inhibitor
Name:
BDBM29518
Synonyms:
Pyranonaphthoquinone (PNQ) lactone, 11h
Type:
Emp. Form.:
C18H16O5
Mol. Mass.:
312.3166
SMILES:
CCC[C@H]1O[C@@H]2CC(=O)O[C@@H]2C2=C1C(=O)c1ccccc1C2=O
:
Substrate
Name:
Biotinylated GSK3 alpha Substrate Peptide
Synonyms:
Type:
Peptide
Mol. Mass.:
1041.12
Organism:
Description:
Residue:
10
SGRARTSSFA