Target
5-hydroxytryptamine receptor 4
Ligand
BDBM29529
Substrate
BDBM29525
Meas. Tech.
Radioligand Binding Assay (Ki) and cAMP Accumulation Assay (EC50)
pH
7.4±n/a
Temperature
298.15±n/a K
Ki
14±7 nM
EC50
9±4 nM
Comments
Emax=70%.
Citation
 Russo, OCachard-Chastel, MRivière, CGiner, MSoulier, JLBerthouze, MRichard, TMonti, JPSicsic, SLezoualc'h, FBerque-Bestel, I Design, synthesis, and biological evaluation of new 5-HT4 receptor agonists: application as amyloid cascade modulators and potential therapeutic utility in Alzheimer's disease. J Med Chem 52:2214-25 (2009)  
Target
Name:
5-hydroxytryptamine receptor 4
Synonyms:
5-HT-4 5-HT4S 5-HT4b 5-HT4d 5-hydroxytryptamine receptor 4 5HT4R_HUMAN Serotonin (5-HT) receptor Serotonin 4 (5-HT4) receptor | Serotonin Receptor 4
Type:
Enzyme
Mol. Mass.:
43767.54
Organism:
Homo sapiens (Human)
Description:
Q13639
Residue:
388
  
Inhibitor
Name:
BDBM29529
Synonyms:
ML10302 scaffold, 14
Type:
Small organic molecule
Emp. Form.:
C50H72Cl2N8O8
Mol. Mass.:
984.061
SMILES:
COc1cc(N)c(Cl)cc1C(=O)OCCN1CCC(CC1)NC(=O)CCCNCCCc1ccc(CCCNCCCC(=O)NC2CCN(CCOC(=O)c3cc(Cl)c(N)cc3OC)CC2)cc1
:
Substrate
Name:
BDBM29525
Synonyms:
3H-GR113808 GR 113808 [3H]GR113808
Type:
radiolabeled ligand
Emp. Form.:
C19H27N3O4S
Mol. Mass.:
393.5
SMILES:
Cn1cc(C(=O)OCC2CCN(CCNS(C)(=O)=O)CC2)c2ccccc12
: