Target
5-hydroxytryptamine receptor 7
Ligand
BDBM29537
Substrate
BDBM21392
Meas. Tech.
Radioligand Binding Assay (Ki)
Ki
1867±n/a nM
Citation
 Badarau, ESuzenet, FBojarski, AJFînaru, ALGuillaumet, G Benzimidazolone-based serotonin 5-HT1A or 5-HT7R ligands: synthesis and biological evaluation. Bioorg Med Chem Lett 19:1600-3 (2009)  
Target
Name:
5-hydroxytryptamine receptor 7
Synonyms:
5-HT-7 5-HT7 5-HT7S 5HT7 HTR7 | Serotonin receptor 7
Type:
G Protein-Coupled Receptor (GPCR)
Mol. Mass.:
53573.08
Organism:
Homo sapiens (Human)
Description:
P34969
Residue:
479
  
Inhibitor
Name:
BDBM29537
Synonyms:
benzimidazolone scaffold, 8e
Type:
Small organic molecule
Emp. Form.:
C26H28N4O
Mol. Mass.:
412.5267
SMILES:
Cc1ccccc1N1CCN(CCn2c3ccccc3n(-c3ccccc3)c2=O)CC1
:
Substrate
Name:
BDBM21392
Synonyms:
3-(2-aminoethyl)-1H-indole-5-carboxamide 5-CT,DP CHEMBL1256863 [3H]-5-CT [3H]-5-Carboxyamidotryptamine | [3H]-5-carboxamidotryptamine
Type:
Small organic molecule
Emp. Form.:
C11H13N3O
Mol. Mass.:
203.2404
SMILES:
NCCc1c[nH]c2ccc(cc12)C(N)=O
: