Target
5-hydroxytryptamine receptor 7
Ligand
BDBM29541
Substrate
BDBM21392
Meas. Tech.
Radioligand Binding Assay (Ki)
Ki
168±n/a nM
Citation
 Badarau, ESuzenet, FBojarski, AJFînaru, ALGuillaumet, G Benzimidazolone-based serotonin 5-HT1A or 5-HT7R ligands: synthesis and biological evaluation. Bioorg Med Chem Lett 19:1600-3 (2009)  
Target
Name:
5-hydroxytryptamine receptor 7
Synonyms:
5-HT-7 5-HT7 5-HT7S 5HT7 HTR7 | Serotonin receptor 7
Type:
G Protein-Coupled Receptor (GPCR)
Mol. Mass.:
53573.08
Organism:
Homo sapiens (Human)
Description:
P34969
Residue:
479
  
Inhibitor
Name:
BDBM29541
Synonyms:
benzimidazolone scaffold, 17d
Type:
Small organic molecule
Emp. Form.:
C28H32N4O3
Mol. Mass.:
472.5787
SMILES:
COc1ccc(cc1)-n1c2ccccc2n(CCCN2CCN(CC2)c2ccccc2OC)c1=O
:
Substrate
Name:
BDBM21392
Synonyms:
3-(2-aminoethyl)-1H-indole-5-carboxamide 5-CT,DP CHEMBL1256863 [3H]-5-CT [3H]-5-Carboxyamidotryptamine | [3H]-5-carboxamidotryptamine
Type:
Small organic molecule
Emp. Form.:
C11H13N3O
Mol. Mass.:
203.2404
SMILES:
NCCc1c[nH]c2ccc(cc12)C(N)=O
: