Target
Tyrosine-protein kinase JAK1
Ligand
BDBM394291
Substrate
Meas. Tech.
JAK Enzyme Assays
Ki
0.250±n/a nM
Citation
 Zak, MRomero, FACheng, Y Therapeutic compounds and compositions, and methods of use thereof US Patent  US10307426 Publication Date 6/4/2019 
Target
Name:
Tyrosine-protein kinase JAK1
Synonyms:
JAK-1 JAK1A JAK1_HUMAN Janus kinase 1 (JAK1) | Janus kinase 1 JAK1
Type:
Protein
Mol. Mass.:
133293.73
Organism:
Homo sapiens (Human)
Description:
P23458
Residue:
1154
  
Inhibitor
Name:
BDBM394291
Synonyms:
N-[3-[2-(difluoromethoxy)-5-[rac- (1R,2R)-2-cyanocyclopropyl]phenyl]- 1-[2-(dimethylamino)-2-oxo- ethyl]pyrazol-4-yl]pyrazolo[1,5- a]pyrimidine-3-carboxamide | US10307426, Example 1
Type:
Small organic molecule
Emp. Form.:
C25H22F2N8O3
Mol. Mass.:
520.4908
SMILES:
CN(C)C(=O)Cn1cc(NC(=O)c2cnn3cccnc23)c(n1)-c1cc(ccc1OC(F)F)[C@@H]1C[C@H]1C#N
: