Target
Tyrosine-protein kinase JAK2
Ligand
BDBM394365
Substrate
Meas. Tech.
JAK Enzyme Assays
Ki
1.15±n/a nM
Citation
 Zak, MRomero, FACheng, Y Therapeutic compounds and compositions, and methods of use thereof US Patent  US10307426 Publication Date 6/4/2019 
Target
Name:
Tyrosine-protein kinase JAK2
Synonyms:
JAK-2 JAK2_HUMAN Janus kinase 2 (JAK2) | Janus kinase 2 (a protein tyrosine kinase)
Type:
Protein
Mol. Mass.:
130684.68
Organism:
Homo sapiens (Human)
Description:
O60674
Residue:
1132
  
Inhibitor
Name:
BDBM394365
Synonyms:
N-[3-[5-(2,2-difluoroethyl)-2- (difluoromethoxy)phenyl]-1-[2- (dimethylamino)-2-oxo-ethyl]pyrazol- 4-yl]pyrazolo[1,5-a]pyrimidine-3- carboxamide | US10307426, Example 7
Type:
Small organic molecule
Emp. Form.:
C23H21F4N7O3
Mol. Mass.:
519.4516
SMILES:
CN(C)C(=O)Cn1cc(NC(=O)c2cnn3cccnc23)c(n1)-c1cc(CC(F)F)ccc1OC(F)F
: